Reaction Details
Target5-hydroxytryptamine receptor 2C
LigandBDBM25870
Substrate/Competitorn/a
Ki 617±n/a nM
CommentsPDSP_532
Citation Millan, MJGobert, ALejeune, FNewman-Tancredi, ARivet, JMAuclair, APeglion, JL S33005, a novel ligand at both serotonin and norepinephrine transporters: I. Receptor binding, electrophysiological, and neurochemical profile in comparison with venlafaxine, reboxetine, citalopram, and clomipramine. J Pharmacol Exp Ther298:565-80 (2001) 5-hydroxytryptamine receptor 2C
Name:5-hydroxytryptamine receptor 2C
Type:G Protein-Coupled Receptor (GPCR)
Mol. Mass.:51836.79
Organism:Homo sapiens (Human)
Description:P28335
Residue:458
BDBM25870
NameBDBM25870
Synonyms:1-[3-(dimethylamino)propyl]-1-(4-fluorophenyl)-1,3-dihydro-2-benzofuran-5-carbonitrile CITALOPRAM Escitalopram [3H]Cytalopram [3H]Lexapro
Typeradiolabeled ligand
Emp. Form.C20H21FN2O
Mol. Mass.324.3919
SMILESCN(C)CCCC1(OCc2cc(ccc12)C#N)c1ccc(F)cc1