Reaction Details
TargetTrace amine-associated receptor 1
LigandBDBM35234
Substrate/Competitorn/a
Ki>10000±n/a nM
CommentsPDSP_1348
Citation Borowsky, BAdham, NJones, KARaddatz, RArtymyshyn, ROgozalek, KLDurkin, MMLakhlani, PPBonini, JAPathirana, SBoyle, NPu, XKouranova, ELichtblau, HOchoa, FYBranchek, TAGerald, C Trace amines: identification of a family of mammalian G protein-coupled receptors. Proc Natl Acad Sci U S A98:8966-71 (2001) 
 
Trace amine-associated receptor 1
Name:Trace amine-associated receptor 1
Type:PROTEIN
Mol. Mass.:39107.47
Organism:Homo sapiens (Human)
Description:ChEMBL_792734
Residue:339
BDBM35234
NameBDBM35234
Synonyms:DL-[7-3H]norepinephrine Noradrenaline,(+) | [3H]NE
Typeradiolabeled ligand
Emp. Form.C8H11NO3
Mol. Mass.169.1778
SMILESNCC(O)c1ccc(O)c(O)c1