Reaction Details
TargetTrace amine-associated receptor 1
LigandBDBM50024210
Substrate/Competitorn/a
Ki 1084±n/a nM
CommentsPDSP_1920
Citation Borowsky, BAdham, NJones, KARaddatz, RArtymyshyn, ROgozalek, KLDurkin, MMLakhlani, PPBonini, JAPathirana, SBoyle, NPu, XKouranova, ELichtblau, HOchoa, FYBranchek, TAGerald, C Trace amines: identification of a family of mammalian G protein-coupled receptors. Proc Natl Acad Sci U S A98:8966-71 (2001) 
 
Trace amine-associated receptor 1
Name:Trace amine-associated receptor 1
Type:PROTEIN
Mol. Mass.:39107.47
Organism:Homo sapiens (Human)
Description:ChEMBL_792734
Residue:339
BDBM50024210
NameBDBM50024210
Synonyms:1H-indole-3-ethanamine 2-(3-indolyl)ethylamine tryptamine
TypeSmall organic molecule
Emp. Form.C10H12N2
Mol. Mass.160.2157
SMILESNCCc1c[nH]c2ccccc12