Reaction Details
TargetTrace amine-associated receptor 1
LigandBDBM29135
Substrate/Competitorn/a
Ki 34±n/a nM
CommentsPDSP_2003
Citation Borowsky, BAdham, NJones, KARaddatz, RArtymyshyn, ROgozalek, KLDurkin, MMLakhlani, PPBonini, JAPathirana, SBoyle, NPu, XKouranova, ELichtblau, HOchoa, FYBranchek, TAGerald, C Trace amines: identification of a family of mammalian G protein-coupled receptors. Proc Natl Acad Sci U S A98:8966-71 (2001) 
 
Trace amine-associated receptor 1
Name:Trace amine-associated receptor 1
Type:PROTEIN
Mol. Mass.:39107.47
Organism:Homo sapiens (Human)
Description:ChEMBL_792734
Residue:339
BDBM29135
NameBDBM29135
Synonyms:CHEMBL11608 p-Tyramine | tyramine
TypeSmall organic molecule
Emp. Form.C8H11NO
Mol. Mass.137.179
SMILESNCCc1ccc(O)cc1