Reaction Details
TargetMuscarinic acetylcholine receptor M4
LigandBDBM85816
Substrate/Competitorn/a
Ki 8.13±n/a nM
CommentsPDSP_2070
Citation Christopoulos, AGrant, MKAyoubzadeh, NKim, ONSauerberg, PJeppesen, LEl-Fakahany, EE Synthesis and pharmacological evaluation of dimeric muscarinic acetylcholine receptor agonists. J Pharmacol Exp Ther298:1260-8 (2001) Muscarinic acetylcholine receptor M4
Name:Muscarinic acetylcholine receptor M4
Type:Enzyme Catalytic Domain
Mol. Mass.:53079.31
Organism:Homo sapiens (Human)
Description:Cholinergic, muscarinic M4 CHRM4 HUMAN M3::P08173
Residue:479
BDBM85816
NameBDBM85816
Synonyms:NNC 11-1607
TypeSmall organic molecule
Emp. Form.C30H32N6O2S2
Mol. Mass.572.744
SMILESC(Oc1nsnc1C1CN2CCC1CC2)C#Cc1cccc(c1)C#CCOc1nsnc1C1CN2CCC1CC2