Reaction Details
TargetMuscarinic acetylcholine receptor M5
LigandBDBM50072228
Substrate/Competitorn/a
Ki 14.7911±n/a nM
CommentsPDSP_2069
Citation Christopoulos, AGrant, MKAyoubzadeh, NKim, ONSauerberg, PJeppesen, LEl-Fakahany, EE Synthesis and pharmacological evaluation of dimeric muscarinic acetylcholine receptor agonists. J Pharmacol Exp Ther298:1260-8 (2001) Muscarinic acetylcholine receptor M5
Name:Muscarinic acetylcholine receptor M5
Type:PROTEIN
Mol. Mass.:60102.35
Organism:Homo sapiens (Human)
Description:ChEMBL_1517990
Residue:532
BDBM50072228
NameBDBM50072228
Synonyms:3-[4-(3-Phenyl-prop-2-ynyloxy)-[1,2,5]thiadiazol-3-yl]-1-aza-bicyclo[2.2.2]octane NNC 11-1314
TypeSmall organic molecule
Emp. Form.C18H19N3OS
Mol. Mass.325.428
SMILESC(Oc1nsnc1C1CN2CCC1CC2)C#Cc1ccccc1