Reaction Details
TargetAlpha-2C adrenergic receptor
LigandBDBM50013515
Substrate/Competitorn/a
Ki 10.6±n/a nM
CommentsPDSP_1987
Citation Sun, BLockyer, SLi, JChen, RYoshitake, MKambayashi, JI OPC-28326, a selective femoral vasodilator, is an alpha2C-adrenoceptor-selective antagonist. J Pharmacol Exp Ther299:652-8 (2001) Alpha-2C adrenergic receptor
Name:Alpha-2C adrenergic receptor
Type:Enzyme Catalytic Domain
Mol. Mass.:49890.50
Organism:RAT
Description:adrenergic Alpha2 0 RAT::P22086
Residue:458
BDBM50013515
NameBDBM50013515
Synonyms:(+)-yohimbine 17alpha-hydroxyyohimban-16alpha-carboxylic acid methyl ester CORYNANTHINE Quebrachin YOHIMBINE CHLORIDE Yohimbine cid_8969 methyl 17alpha-hydroxyyohimban-16alpha-carboxylate yohimbic acid methyl ester
TypeSmall organic molecule
Emp. Form.C21H26N2O3
Mol. Mass.354.4427
SMILESCOC(=O)[C@H]1[C@@H](O)CC[C@H]2CN3CCc4c([nH]c5ccccc45)[C@@H]3C[C@H]12