Reaction Details
Target5-hydroxytryptamine receptor 3A
LigandBDBM85826
Substrate/Competitorn/a
Ki 500±n/a nM
CommentsPDSP_2299
Citation Rënyi, LEvenden, JLFowler, CJJerning, EKelder, DLake-Bakaar, DLarsson, LGMohell, NSällemark, MRoss, SB The pharmacological profile of (R)-3,4-dihydro-N-isopropyl-3-(N-isopropyl-N-propylamino)-2H-1-benzopyran-5-carboxamide, a selective 5-hydroxytryptamine(1A) receptor agonist. J Pharmacol Exp Ther299:883-93 (2001) 5-hydroxytryptamine receptor 3A
Name:5-hydroxytryptamine receptor 3A
Type:Enzyme Catalytic Domain
Mol. Mass.:55428.70
Organism:RAT
Description:5-HT3 HTR3A RAT::P35563
Residue:483
BDBM85826
NameBDBM85826
Synonyms:(R)-N-Isopropyl-3-[isopropyl(propyl)amino]-3,4-dihydro-2H-1-benzopyran-5-carboxamide | NAE-086
TypeSmall organic molecule
Emp. Form.C19H30N2O2
Mol. Mass.318.4537
SMILESCCCN(C(C)C)[C@H]1COc2cccc(C(=O)NC(C)C)c2C1