Reaction Details
TargetHrh3 protein
LigandBDBM22904
Substrate/Competitorn/a
Ki 9.12±n/a nM
CommentsPDSP_270
Citation Wieland, KBongers, GYamamoto, YHashimoto, TYamatodani, AMenge, WMTimmerman, HLovenberg, TWLeurs, R Constitutive activity of histamine h(3) receptors stably expressed in SK-N-MC cells: display of agonism and inverse agonism by H(3) antagonists. J Pharmacol Exp Ther299:908-14 (2001) Hrh3 protein
Name:Hrh3 protein
Type:Enzyme Catalytic Domain
Mol. Mass.:37860.96
Organism:RAT
Description:Q5PPG3
Residue:344
BDBM22904
NameBDBM22904
Synonyms:(2R)-1-(1H-imidazol-5-yl)propan-2-amine Alpha-Methylhistamine-R CHEMBL268229 RAMH
TypeSmall organic molecule
Emp. Form.C6H11N3
Mol. Mass.125.1716
SMILESC[C@@H](N)Cc1cnc[nH]1