Reaction Details
TargetHistamine H3 receptor
LigandBDBM22911
Substrate/Competitorn/a
Ki 1.62±n/a nM
CommentsPDSP_968
Citation Wieland, KBongers, GYamamoto, YHashimoto, TYamatodani, AMenge, WMTimmerman, HLovenberg, TWLeurs, R Constitutive activity of histamine h(3) receptors stably expressed in SK-N-MC cells: display of agonism and inverse agonism by H(3) antagonists. J Pharmacol Exp Ther299:908-14 (2001) Histamine H3 receptor
Name:Histamine H3 receptor
Type:G Protein-Coupled Receptor (GPCR)
Mol. Mass.:48691.47
Organism:Homo sapiens (Human)
Description:Binding assays were using CHO cells stably expressing hH3R receptors.
Residue:445
BDBM22911
NameBDBM22911
Synonyms:2-(3H-imidazol-4-yl)ethylsulfanylmethanimidamide CHEMBL544911 {[2-(1H-imidazol-4-yl)ethyl]sulfanyl}methanimidamide
TypeSmall organic molecule
Emp. Form.C6H10N4S
Mol. Mass.170.235
SMILESNC(=N)SCCc1cnc[nH]1