Reaction Details
TargetHistamine H3 receptor
LigandBDBM22912
Substrate/Competitorn/a
Ki 3.31±n/a nM
CommentsPDSP_2291
Citation Wieland, KBongers, GYamamoto, YHashimoto, TYamatodani, AMenge, WMTimmerman, HLovenberg, TWLeurs, R Constitutive activity of histamine h(3) receptors stably expressed in SK-N-MC cells: display of agonism and inverse agonism by H(3) antagonists. J Pharmacol Exp Ther299:908-14 (2001) Histamine H3 receptor
Name:Histamine H3 receptor
Type:G Protein-Coupled Receptor (GPCR)
Mol. Mass.:48691.47
Organism:Homo sapiens (Human)
Description:Binding assays were using CHO cells stably expressing hH3R receptors.
Residue:445
BDBM22912
NameBDBM22912
Synonyms:VUF 8328 {[3-(1H-imidazol-4-yl)propyl]sulfanyl}methanimidamide
TypeSmall organic molecule
Emp. Form.C7H12N4S
Mol. Mass.184.262
SMILESNC(=N)SCCCc1cnc[nH]1