Reaction Details
TargetCalcitonin gene-related peptide type 1 receptor
LigandBDBM85838
Substrate/Competitorn/a
Ki 32.7±n/a nM
CommentsPDSP_2306
Citation Rorabaugh, BRScofield, MASmith, DDJeffries, WBAbel, PW Functional calcitonin gene-related peptide subtype 2 receptors in porcine coronary arteries are identified as calcitonin gene-related peptide subtype 1 receptors by radioligand binding and reverse transcription-polymerase chain reaction. J Pharmacol Exp Ther299:1086-94 (2001) Calcitonin gene-related peptide type 1 receptor
Name:Calcitonin gene-related peptide type 1 receptor
Type:Enzyme Catalytic Domain
Mol. Mass.:53657.10
Organism:PIG
Description:CGRP 0 PIG::Q8WN93
Residue:462
BDBM85838
NameBDBM85838
Synonyms:[Cha37]h alpha-CGRP8-37
TypeSmall organic molecule
Emp. Form.C139H236N44O38
Mol. Mass.3131.6331
SMILESCC(C)C[C@H](NC(=O)CNC(=O)[C@H](C)NC(=O)[C@H](CC(C)C)NC(=O)[C@H](CCCN=C(N)N)NC(=O)[C@H](Cc1cnc[nH]1)NC(=O)[C@@H](NC(=O)[C@@H](N)C(C)C)[C@@H](C)O)C(=O)N[C@@H](CC(C)C)C(=O)N[C@@H](CO)C(=O)N[C@@H](CCCN=C(N)N)C(=O)N[C@@H](CO)C(=O)NCC(=O)NCC(=O)N[C@@H](C(C)C)C(=O)N[C@@H](C(C)C)C(=O)N[C@@H](CCCCN)C(=O)N[C@@H](CC(N)=O)C(=O)N[C@@H](CC(N)=O)C(=O)N[C@@H](Cc1ccccc1)C(=O)N[C@@H](C(C)C)C(=O)N1CCC[C@H]1C(=O)N[C@@H]([C@@H](C)O)C(=O)N[C@@H](CC(N)=O)C(=O)N[C@@H](C(C)C)C(=O)NCC(=O)N[C@@H](CO)C(=O)N[C@@H](CCCCN)C(=O)N[C@@H](C)C(=O)N[C@@H](CC1CCCCC1)C(N)=O