Reaction Details
TargetReceptor activity-modifying protein 1
LigandBDBM50000743
Substrate/Competitorn/a
Ki 5.7±n/a nM
CommentsPDSP_2301
Citation Rorabaugh, BRScofield, MASmith, DDJeffries, WBAbel, PW Functional calcitonin gene-related peptide subtype 2 receptors in porcine coronary arteries are identified as calcitonin gene-related peptide subtype 1 receptors by radioligand binding and reverse transcription-polymerase chain reaction. J Pharmacol Exp Ther299:1086-94 (2001) Receptor activity-modifying protein 1
Name:Receptor activity-modifying protein 1
Type:Enzyme Catalytic Domain
Mol. Mass.:16766.13
Organism:PIG
Description:CGRP1 RAMP1 PIG::Q867C0
Residue:148
BDBM50000743
NameBDBM50000743
Synonyms:CHEMBL525571 h alpha-CGRP8-37
TypeSmall organic molecule
Emp. Form.C139H230N44O38
Mol. Mass.3125.5855
SMILESCC(C)C[C@H](NC(=O)CNC(=O)[C@H](C)NC(=O)[C@H](CC(C)C)NC(=O)[C@H](CCCNC(N)=N)NC(=O)[C@H](Cc1cnc[nH]1)NC(=O)[C@@H](NC(=O)[C@@H](N)C(C)C)[C@@H](C)O)C(=O)N[C@@H](CC(C)C)C(=O)N[C@@H](CO)C(=O)N[C@@H](CCCNC(N)=N)C(=O)N[C@@H](CO)C(=O)NCC(=O)NCC(=O)N[C@@H](C(C)C)C(=O)N[C@@H](C(C)C)C(=O)N[C@@H](CCCCN)C(=O)N[C@@H](CC(N)=O)C(=O)N[C@@H](CC(N)=O)C(=O)N[C@@H](Cc1ccccc1)C(=O)N[C@@H](C(C)C)C(=O)N1CCC[C@H]1C(=O)N[C@@H]([C@@H](C)O)C(=O)N[C@@H](CC(N)=O)C(=O)N[C@@H](C(C)C)C(=O)NCC(=O)N[C@@H](CO)C(=O)N[C@@H](CCCCN)C(=O)N[C@@H](C)C(=O)N[C@@H](Cc1ccccc1)C(N)=O