Reaction Details
TargetReceptor activity-modifying protein 1
LigandBDBM85836
Substrate/Competitorn/a
Ki 0.072±n/a nM
CommentsPDSP_2310
Citation Rorabaugh, BRScofield, MASmith, DDJeffries, WBAbel, PW Functional calcitonin gene-related peptide subtype 2 receptors in porcine coronary arteries are identified as calcitonin gene-related peptide subtype 1 receptors by radioligand binding and reverse transcription-polymerase chain reaction. J Pharmacol Exp Ther299:1086-94 (2001) Receptor activity-modifying protein 1
Name:Receptor activity-modifying protein 1
Type:Enzyme Catalytic Domain
Mol. Mass.:16766.13
Organism:PIG
Description:CGRP1 RAMP1 PIG::Q867C0
Residue:148
BDBM85836
NameBDBM85836
Synonyms:[N-benzol]h alpha-CGRP8-37
TypeSmall organic molecule
Emp. Form.C146H236N44O39
Mol. Mass.3231.7074
SMILESCC(C)C[C@H](NC(=O)CNC(=O)[C@H](C)NC(=O)[C@H](CC(C)C)NC(=O)[C@H](CCCN=C(N)N)NC(=O)[C@H](Cc1cnc[nH]1)NC(=O)[C@@H](NC(=O)[C@@H](NCc1ccc(O)cc1)C(C)C)[C@@H](C)O)C(=O)N[C@@H](CC(C)C)C(=O)N[C@@H](CO)C(=O)N[C@@H](CCCN=C(N)N)C(=O)N[C@@H](CO)C(=O)NCC(=O)NCC(=O)N[C@@H](C(C)C)C(=O)N[C@@H](C(C)C)C(=O)N[C@@H](CCCCN)C(=O)N[C@@H](CC(N)=O)C(=O)N[C@@H](CC(N)=O)C(=O)N[C@@H](Cc1ccccc1)C(=O)N[C@@H](C(C)C)C(=O)N1CCC[C@H]1C(=O)N[C@@H]([C@@H](C)O)C(=O)N[C@@H](CC(N)=O)C(=O)N[C@@H](C(C)C)C(=O)NCC(=O)N[C@@H](CO)C(=O)N[C@@H](CCCCN)C(=O)N[C@@H](C)C(=O)N[C@@H](Cc1ccccc1)C(N)=O