Reaction Details
TargetAdenosine receptor A2b
LigandBDBM84745
Substrate/Competitorn/a
Ki 1000±n/a nM
CommentsPDSP_763
Citation Bymaster, FPDreshfield-Ahmad, LJThrelkeld, PGShaw, JLThompson, LNelson, DLHemrick-Luecke, SKWong, DT Comparative affinity of duloxetine and venlafaxine for serotonin and norepinephrine transporters in vitro and in vivo, human serotonin receptor subtypes, and other neuronal receptors. Neuropsychopharmacology25:871-80 (2001) 
 
Adenosine receptor A2b
Name:Adenosine receptor A2b
Type:Enzyme Catalytic Domain
Mol. Mass.:36398.35
Organism:BOVINE
Description:ADENOSINE A2 0 BOVINE::Q1LZD0
Residue:332
BDBM84745
NameBDBM84745
Synonyms:CAS_136434-34-9 LY-248686 USRE49340, Rank 5
TypeSmall organic molecule
Emp. Form.C18H19NOS
Mol. Mass.297.415
SMILESCNCC[C@H](Oc1cccc2ccccc12)c1cccs1