Reaction Details
TargetCalcium-activated potassium channel subunit beta-1
LigandBDBM84745
Substrate/Competitorn/a
Ki 1000±n/a nM
CommentsPDSP_763
Citation Bymaster, FPDreshfield-Ahmad, LJThrelkeld, PGShaw, JLThompson, LNelson, DLHemrick-Luecke, SKWong, DT Comparative affinity of duloxetine and venlafaxine for serotonin and norepinephrine transporters in vitro and in vivo, human serotonin receptor subtypes, and other neuronal receptors. Neuropsychopharmacology25:871-80 (2001) 
 
Calcium-activated potassium channel subunit beta-1
Name:Calcium-activated potassium channel subunit beta-1
Type:Enzyme Catalytic Domain
Mol. Mass.:21917.35
Organism:RAT
Description:Potassium Channel (Ca2+ dependent) 0 RAT::P97678
Residue:191
BDBM84745
NameBDBM84745
Synonyms:CAS_136434-34-9 LY-248686 USRE49340, Rank 5
TypeSmall organic molecule
Emp. Form.C18H19NOS
Mol. Mass.297.415
SMILESCNCC[C@H](Oc1cccc2ccccc12)c1cccs1