Reaction Details
TargetSubstance-K receptor
LigandBDBM85845
Substrate/Competitorn/a
Ki>10000±n/a nM
CommentsPDSP_2451
Citation Hay, DWGiardina, GAGriswold, DEUnderwood, DCKotzer, CJBush, BPotts, WSandhu, PLundberg, DFoley, JJSchmidt, DBMartin, LDKilian, DLegos, JJBarone, FCLuttmann, MAGrugni, MRaveglia, LFSarau, HM Nonpeptide tachykinin receptor antagonists. III. SB 235375, a low central nervous system-penetrant, potent and selective neurokinin-3 receptor antagonist, inhibits citric acid-induced cough and airways hyper-reactivity in guinea pigs. J Pharmacol Exp Ther300:314-23 (2002) 
 
Substance-K receptor
Name:Substance-K receptor
Type:Enzyme Catalytic Domain
Mol. Mass.:45106.00
Organism:GUINEA PIG
Description:Neurokinin NK2 TACR2 GUINEA PIG::Q64077
Residue:402
BDBM85845
NameBDBM85845
Synonyms:N-[(S)-1-Phenylpropyl]-2-phenyl-3-(carboxymethoxy)quinoline-4-carboxamide | SB 235375
TypeSmall organic molecule
Emp. Form.C27H24N2O4
Mol. Mass.440.4905
SMILESCC[C@H](NC(=O)c1c(OCC(O)=O)c(nc2ccccc12)-c1ccccc1)c1ccccc1