Reaction Details
TargetHistamine H1 receptor
LigandBDBM85849
Substrate/Competitorn/a
Ki 5.01±n/a nM
CommentsPDSP_2092
Citation Gillard, MVan Der Perren, CMoguilevsky, NMassingham, RChatelain, P Binding characteristics of cetirizine and levocetirizine to human H(1) histamine receptors: contribution of Lys(191) and Thr(194). Mol Pharmacol61:391-9 (2002) 
 
Histamine H1 receptor
Name:Histamine H1 receptor
Type:G Protein-Coupled Receptor (GPCR)
Mol. Mass.:55808.72
Organism:Homo sapiens (Human)
Description:Cell pellets from SK-N-MC cells transfected with human H1 receptor were used in binding assay.
Residue:487
BDBM85849
NameBDBM85849
Synonyms:ucb 29992, (R)
TypeSmall organic molecule
Emp. Form.C22H27ClN2O3
Mol. Mass.402.914
SMILESCOC(=O)COCCN1CCN(CC1)[C@H](c1ccccc1)c1ccc(Cl)cc1