Reaction Details
TargetAdenosine receptor A3
LigandBDBM50109456
Substrate/Competitorn/a
Ki 0.93±n/a nM
CommentsPDSP_2333
Citation Gessi, SVarani, KMerighi, SCattabriga, EIannotta, VLeung, EBaraldi, PGBorea, PA A(3) adenosine receptors in human neutrophils and promyelocytic HL60 cells: a pharmacological and biochemical study. Mol Pharmacol61:415-24 (2002) 
 
Adenosine receptor A3
Name:Adenosine receptor A3
Type:G Protein-Coupled Receptor (GPCR)
Mol. Mass.:36197.32
Organism:Homo sapiens (Human)
Description:P0DMS8
Residue:318
BDBM50109456
NameBDBM50109456
Synonyms:1-(8-Butyl-2-furan-2-yl-8H-pyrazolo[4,3-e][1,2,4]triazolo[1,5-c]pyrimidin-5-yl)-3-phenyl-urea CHEMBL349240 | MRE 3062F20
TypeSmall organic molecule
Emp. Form.C21H20N8O2
Mol. Mass.416.4359
SMILESCCCCn1cc2c(n1)nc(NC(=O)Nc1ccccc1)n1nc(nc21)-c1ccco1