Reaction Details
TargetCannabinoid receptor 1
LigandBDBM85851
Substrate/Competitorn/a
Ki 1801±n/a nM
CommentsPDSP_2208
Citation Di Marzo, VGriffin, GDe Petrocellis, LBrandi, IBisogno, TWilliams, WGrier, MCKulasegram, SMahadevan, ARazdan, RKMartin, BR A structure/activity relationship study on arvanil, an endocannabinoid and vanilloid hybrid. J Pharmacol Exp Ther300:984-91 (2002) 
 
Cannabinoid receptor 1
Name:Cannabinoid receptor 1
Type:G Protein-Coupled Receptor (GPCR)
Mol. Mass.:52856.55
Organism:Rattus norvegicus (rat)
Description:P20272
Residue:473
BDBM85851
NameBDBM85851
Synonyms:O-2109
TypeSmall organic molecule
Emp. Form.C27H39ClN2OS
Mol. Mass.475.129
SMILESCCCCC\C=C/C\C=C/C\C=C/C\C=C/CCCNC(=S)NCc1ccc(O)c(Cl)c1