Reaction Details
TargetCannabinoid receptor 1
LigandBDBM85856
Substrate/Competitorn/a
Ki 483±n/a nM
CommentsPDSP_2207
Citation Di Marzo, VGriffin, GDe Petrocellis, LBrandi, IBisogno, TWilliams, WGrier, MCKulasegram, SMahadevan, ARazdan, RKMartin, BR A structure/activity relationship study on arvanil, an endocannabinoid and vanilloid hybrid. J Pharmacol Exp Ther300:984-91 (2002) 
 
Cannabinoid receptor 1
Name:Cannabinoid receptor 1
Type:G Protein-Coupled Receptor (GPCR)
Mol. Mass.:52856.55
Organism:Rattus norvegicus (rat)
Description:P20272
Residue:473
BDBM85856
NameBDBM85856
Synonyms:O-2142
TypeSmall organic molecule
Emp. Form.C36H54N2O5
Mol. Mass.594.8244
SMILESCCCCC\C=C/C\C=C/C\C=C/C\C=C/CCCC(=O)NCc1ccc(OC(=O)CCCN2CCOCC2)c(OC)c1