Reaction Details
TargetVIP peptides
LigandBDBM85899
Substrate/Competitorn/a
Ki 0.47±n/a nM
CommentsPDSP_2145
Citation Igarashi, HIto, THou, WMantey, SAPradhan, TKUlrich, CDHocart, SJCoy, DHJensen, RT Elucidation of vasoactive intestinal peptide pharmacophore for VPAC(1) receptors in human, rat, and guinea pig. J Pharmacol Exp Ther301:37-50 (2002) 
 
VIP peptides
Name:VIP peptides
Type:Enzyme Catalytic Domain
Mol. Mass.:19078.15
Organism:RAT
Description:VIP 0 RAT::P01283
Residue:170
BDBM85899
NameBDBM85899
Synonyms:VIP Ala25 | VIP Ala26
TypeSmall organic molecule
Emp. Form.C144H232N44O42S
Mol. Mass.3283.717
SMILESCSCC[C@H](NC(=O)[C@H](CCC(N)=O)NC(=O)[C@H](CCCCN)NC(=O)[C@H](CCCN=C(N)N)NC(=O)[C@H](CC(C)C)NC(=O)[C@H](CCCN=C(N)N)NC(=O)C(NC(=O)[C@H](Cc1ccc(O)cc1)NC(=O)[C@H](CC(N)=O)NC(=O)[C@H](CC(O)=O)NC(=O)[C@@H](NC(=O)[C@H](Cc1ccccc1)NC(=O)[C@@H](NC(=O)[C@H](C)NC(=O)[C@H](CC(O)=O)NC(=O)[C@H](CO)NC(=O)[C@@H](N)Cc1cnc[nH]1)C(C)C)[C@@H](C)O)[C@@H](C)O)C(=O)N[C@@H](C)C(=O)N[C@@H](C(C)C)C(=O)N[C@@H](CCCCN)C(=O)N[C@@H](CCCCN)C(=O)N[C@@H](Cc1ccc(O)cc1)C(=O)N[C@@H](CC(C)C)C(=O)N[C@@H](CC(N)=O)C(=O)N[C@@H](CO)C(=O)N[C@@H](C)C(=O)N[C@@H](CC(C)C)C(=O)N[C@@H](CC(N)=O)C(N)=O