Reaction Details
TargetMelanin-concentrating hormone receptor 1
LigandBDBM50150715
Substrate/Competitorn/a
Ki 8.6±n/a nM
CommentsPDSP_2491
Citation Takekawa, SAsami, AIshihara, YTerauchi, JKato, KShimomura, YMori, MMurakoshi, HKato, KSuzuki, NNishimura, OFujino, M T-226296: a novel, orally active and selective melanin-concentrating hormone receptor antagonist. Eur J Pharmacol438:129-35 (2002) 
 
Melanin-concentrating hormone receptor 1
Name:Melanin-concentrating hormone receptor 1
Type:Enzyme Catalytic Domain
Mol. Mass.:39075.64
Organism:RAT
Description:Melanin Concentrating Hormone 1 GPR24 RAT::P97639
Residue:353
BDBM50150715
NameBDBM50150715
Synonyms:4''-Fluoro-biphenyl-4-carboxylic acid (6-dimethylaminomethyl-5,6,7,8-tetrahydro-naphthalen-2-yl)-amide CHEMBL178707 T-226296
TypeSmall organic molecule
Emp. Form.C26H27FN2O
Mol. Mass.402.5038
SMILESCN(C)CC1CCc2cc(NC(=O)c3ccc(cc3)-c3ccc(F)cc3)ccc2C1