Reaction Details
TargetSodium-dependent serotonin transporter
LigandBDBM25870
Substrate/Competitorn/a
Ki 9.2±n/a nM
CommentsPDSP_532
Citation Schweri, MMDeutsch, HMMassey, ATHoltzman, SG Biochemical and behavioral characterization of novel methylphenidate analogs. J Pharmacol Exp Ther301:527-35 (2002) 
 
Sodium-dependent serotonin transporter
Name:Sodium-dependent serotonin transporter
Type:Multi-pass membrane protein
Mol. Mass.:70168.43
Organism:Rattus norvegicus (rat)
Description:P31652
Residue:630
BDBM25870
NameBDBM25870
Synonyms:1-[3-(dimethylamino)propyl]-1-(4-fluorophenyl)-1,3-dihydro-2-benzofuran-5-carbonitrile CITALOPRAM Escitalopram [3H]Cytalopram [3H]Lexapro
Typeradiolabeled ligand
Emp. Form.C20H21FN2O
Mol. Mass.324.3919
SMILESCN(C)CCCC1(OCc2cc(ccc12)C#N)c1ccc(F)cc1