Reaction Details
TargetSodium-dependent dopamine transporter
LigandBDBM85942
Substrate/Competitorn/a
Ki 35±n/a nM
CommentsPDSP_2115
Citation Schweri, MMDeutsch, HMMassey, ATHoltzman, SG Biochemical and behavioral characterization of novel methylphenidate analogs. J Pharmacol Exp Ther301:527-35 (2002) 
 
Sodium-dependent dopamine transporter
Name:Sodium-dependent dopamine transporter
Type:Multi-pass membrane protein
Mol. Mass.:68749.45
Organism:Rattus norvegicus (rat)
Description:P23977
Residue:619
BDBM85942
NameBDBM85942
Synonyms:4FTMP
TypeSmall organic molecule
Emp. Form.C14H18FNO2
Mol. Mass.251.2966
SMILESCOC(=O)[C@@H]([C@@H]1CCCCN1)c1ccc(F)cc1