Reaction Details
TargetSodium-dependent dopamine transporter
LigandBDBM85943
Substrate/Competitorn/a
Ki 140±n/a nM
CommentsPDSP_2116
Citation Schweri, MMDeutsch, HMMassey, ATHoltzman, SG Biochemical and behavioral characterization of novel methylphenidate analogs. J Pharmacol Exp Ther301:527-35 (2002) 
 
Sodium-dependent dopamine transporter
Name:Sodium-dependent dopamine transporter
Type:Multi-pass membrane protein
Mol. Mass.:68749.45
Organism:Rattus norvegicus (rat)
Description:P23977
Residue:619
BDBM85943
NameBDBM85943
Synonyms:4MeTMPNMe
TypeSmall organic molecule
Emp. Form.C16H23NO2
Mol. Mass.261.3593
SMILESCOC(=O)[C@@H]([C@@H]1CCCCN1C)c1ccc(C)cc1