Reaction Details
TargetSodium-dependent dopamine transporter
LigandBDBM85941
Substrate/Competitorn/a
Ki 52.9±n/a nM
CommentsPDSP_2118
Citation Schweri, MMDeutsch, HMMassey, ATHoltzman, SG Biochemical and behavioral characterization of novel methylphenidate analogs. J Pharmacol Exp Ther301:527-35 (2002) 
 
Sodium-dependent dopamine transporter
Name:Sodium-dependent dopamine transporter
Type:Multi-pass membrane protein
Mol. Mass.:68749.45
Organism:Rattus norvegicus (rat)
Description:P23977
Residue:619
BDBM85941
NameBDBM85941
Synonyms:TMPNBn
TypeSmall organic molecule
Emp. Form.C18H27NO2
Mol. Mass.289.4125
SMILESCCCCN1CCCC[C@H]1[C@H](C(=O)OC)c1ccccc1