Reaction Details
TargetSodium-dependent dopamine transporter
LigandBDBM85938
Substrate/Competitorn/a
Ki 17.8±n/a nM
CommentsPDSP_2119
Citation Schweri, MMDeutsch, HMMassey, ATHoltzman, SG Biochemical and behavioral characterization of novel methylphenidate analogs. J Pharmacol Exp Ther301:527-35 (2002) 
 
Sodium-dependent dopamine transporter
Name:Sodium-dependent dopamine transporter
Type:Multi-pass membrane protein
Mol. Mass.:68749.45
Organism:Rattus norvegicus (rat)
Description:P23977
Residue:619
BDBM85938
NameBDBM85938
Synonyms:TROMeNBn
TypeSmall organic molecule
Emp. Form.C18H29NO
Mol. Mass.275.429
SMILESCCCCN1CCCC[C@H]1[C@H](COC)c1ccccc1