Reaction Details
TargetMelanin-concentrating hormone receptor 2
LigandBDBM85958
Substrate/Competitorn/a
Ki 63±n/a nM
CommentsPDSP_2476
Citation Bednarek, MAHreniuk, DLTan, CPalyha, OCMacNeil, DJVan der Ploeg, LHHoward, ADFeighner, SD Synthesis and biological evaluation in vitro of selective, high affinity peptide antagonists of human melanin-concentrating hormone action at human melanin-concentrating hormone receptor 1. Biochemistry41:6383-90 (2002) 
 
Melanin-concentrating hormone receptor 2
Name:Melanin-concentrating hormone receptor 2
Type:Enzyme Catalytic Domain
Mol. Mass.:38862.16
Organism:Homo sapiens (Human)
Description:Melanin Concentrating Hormone 2 GPR145 HUMAN::Q969V1
Residue:340
BDBM85958
NameBDBM85958
Synonyms:Aoct8,9,10
TypeSmall organic molecule
Emp. Form.C53H89N19O11S2
Mol. Mass.1232.524
SMILES[#6]-[#6](-[#6])-[#6]-1-[#7]-[#6](=O)-[#6](-[#6]-[#6]-[#6]\[#7]=[#6](\[#7])-[#7])-[#7]-[#6](=O)-[#6]-[#6]-[#6]-[#6]-[#6]-[#6]-[#6]-[#7]-[#6](=O)-[#6](-[#6]-[#16]-[#16]-[#6]-[#6](-[#7]-[#6](=O)-[#6]-2-[#6]-[#6]-[#6]-[#7]-2-[#6](=O)-[#6](-[#6]-[#6]-[#6]\[#7]=[#6](\[#7])-[#7])-[#7]-[#6](=O)-[#6](-[#6]-c2ccc(-[#8])cc2)-[#7]-[#6]-1=O)-[#6](-[#7])=O)-[#7]-[#6](=O)-[#6](-[#6]-[#6]-[#6]\[#7]=[#6](\[#7])-[#7])-[#7]-[#6](-[#6])=O