Reaction Details
TargetNorepinephrine transporter
LigandBDBM22417
Substrate/Competitorn/a
Ki 0.46±n/a nM
CommentsPDSP_1329
Citation Davids, EZhang, KKula, NSTarazi, FIBaldessarini, RJ Effects of norepinephrine and serotonin transporter inhibitors on hyperactivity induced by neonatal 6-hydroxydopamine lesioning in rats. J Pharmacol Exp Ther301:1097-102 (2002) 
 
Norepinephrine transporter
Name:Norepinephrine transporter
Synonyms:n/a
Type:Enzyme Catalytic Domain
Mol. Mass.:2082.45
Organism:RAT
Description:Norepinephrine transporter 0 RAT::Q9JIA2
Residue:19
MLLARMKPQVQPELGGADQ
BDBM22417
NameBDBM22417
Typeradiolabeled ligand
Emp. Form.C17H21NO2
Mol. Mass.271.3541
SMILESCNCCC(Oc1ccccc1OC)c1ccccc1