Reaction Details
TargetPromotilin
LigandBDBM85990
Substrate/Competitorn/a
Ki 7.24±n/a nM
CommentsPDSP_6203
Citation Thielemans, LDepoortere, IVanden Broeck, JPeeters, TL The motilin pharmacophore in CHO cells expressing the human motilin receptor. Biochem Biophys Res Commun293:1223-7 (2002) 
 
Promotilin
Name:Promotilin
Type:Enzyme Catalytic Domain
Mol. Mass.:12919.83
Organism:Homo sapiens (Human)
Description:Motilin 0 HUMAN::P12872
Residue:115
BDBM85990
NameBDBM85990
Synonyms:[ala13,leu13]pMOT(1-14)
TypeSmall organic molecule
Emp. Form.C79H118N20O20
Mol. Mass.1667.9042
SMILES[#6]-[#6]-[#6@H](-[#6])-[#6@H](-[#7]-[#6](=O)-[#6@@H]-1-[#6]-[#6]-[#6]-[#7]-1-[#6](=O)-[#6@@H](-[#7]-[#6](=O)-[#6@@H](-[#7])-[#6]-c1ccccc1)-[#6](-[#6])-[#6])-[#6](=O)-[#7]-[#6@@H](-[#6]-c1ccccc1)-[#6](=O)-[#7]-[#6@@H](-[#6@@H](-[#6])-[#8])-[#6](=O)-[#7]-[#6@@H](-[#6]-c1ccc(-[#8])cc1)-[#6](=O)-[#7]-[#6]-[#6](=O)-[#7]-[#6@@H](-[#6]-[#6]-[#6](-[#8])=O)-[#6](=O)-[#7]-[#6@@H](-[#6]-[#6](-[#6])-[#6])-[#6](=O)-[#7]-[#6@@H](-[#6]-[#6]-[#6](-[#7])=O)-[#6](=O)-[#7]-[#6@@H](-[#6]-[#6]-[#6]\[#7]=[#6](/[#7])-[#7])-[#6](=O)-[#7]-[#6@@H](-[#6])-[#6](=O)-[#7]-[#6@@H](-[#6]-[#6]-[#6](-[#7])=O)-[#6](-[#7])=O