Reaction Details
TargetPromotilin
LigandBDBM85981
Substrate/Competitorn/a
Ki 3.16±n/a nM
CommentsPDSP_6188
Citation Thielemans, LDepoortere, IVanden Broeck, JPeeters, TL The motilin pharmacophore in CHO cells expressing the human motilin receptor. Biochem Biophys Res Commun293:1223-7 (2002) 
 
Promotilin
Name:Promotilin
Type:Enzyme Catalytic Domain
Mol. Mass.:12919.83
Organism:Homo sapiens (Human)
Description:Motilin 0 HUMAN::P12872
Residue:115
BDBM85981
NameBDBM85981
Synonyms:[ala1,leu13]pMOT(1-14) | [leu13]pMOT(1-14)
TypeSmall organic molecule
Emp. Form.C82H124N20O20
Mol. Mass.1709.984
SMILES[#6]-[#6]-[#6@H](-[#6])-[#6@H](-[#7]-[#6](=O)-[#6@@H]-1-[#6]-[#6]-[#6]-[#7]-1-[#6](=O)-[#6@@H](-[#7]-[#6](=O)-[#6@@H](-[#7])-[#6]-c1ccccc1)-[#6](-[#6])-[#6])-[#6](=O)-[#7]-[#6@@H](-[#6]-c1ccccc1)-[#6](=O)-[#7]-[#6@@H](-[#6@@H](-[#6])-[#8])-[#6](=O)-[#7]-[#6@@H](-[#6]-c1ccc(-[#8])cc1)-[#6](=O)-[#7]-[#6]-[#6](=O)-[#7]-[#6@@H](-[#6]-[#6]-[#6](-[#8])=O)-[#6](=O)-[#7]-[#6@@H](-[#6]-[#6](-[#6])-[#6])-[#6](=O)-[#7]-[#6@@H](-[#6]-[#6]-[#6](-[#7])=O)-[#6](=O)-[#7]-[#6@@H](-[#6]-[#6]-[#6]\[#7]=[#6](/[#7])-[#7])-[#6](=O)-[#7]-[#6@@H](-[#6]-[#6](-[#6])-[#6])-[#6](=O)-[#7]-[#6@@H](-[#6]-[#6]-[#6](-[#7])=O)-[#6](-[#7])=O