Reaction Details
TargetCarboxylic ester hydrolase
LigandBDBM86002
Substrate/Competitorn/a
Meas. Tech.Enzyme Inhibition Assay
pH8±0
Temperature298.15±0 K
IC50 1.60e+4± 3e+2 nM
Citation Hasan, AKhan, KMSher, MMaharvi, GMNawaz, SAChoudhary, MIAtta-ur-Rahman, ASupuran, CT Synthesis and inhibitory potential towards acetylcholinesterase, butyrylcholinesterase and lipoxygenase of some variably substituted chalcones. J Enzyme Inhib Med Chem20:41-7 (2005) 
 
Carboxylic ester hydrolase
Name:Carboxylic ester hydrolase
Type:Protein
Mol. Mass.:68842.83
Organism:Equus caballus (Horse)
Description:Q9N1N9
Residue:602
BDBM86002
NameBDBM86002
Synonyms:(E)-1-phenyl-3-(2-hydroxyphenyl)-2-propen-1-one (8) | Chalcone, 1
TypeSmall organic molecule
Emp. Form.C15H12O2
Mol. Mass.224.2546
SMILESOc1ccccc1\C=C\C(=O)c1ccccc1