Reaction Details
TargetAcetylcholinesterase
LigandBDBM86010
Substrate/Competitorn/a
Meas. Tech.Enzyme Inhibition Assay
pH8±0
Temperature298.15±0 K
IC50 3.92e+4± 5.3e+2 nM
Citation Hasan, AKhan, KMSher, MMaharvi, GMNawaz, SAChoudhary, MIAtta-ur-Rahman, ASupuran, CT Synthesis and inhibitory potential towards acetylcholinesterase, butyrylcholinesterase and lipoxygenase of some variably substituted chalcones. J Enzyme Inhib Med Chem20:41-7 (2005) 
 
Acetylcholinesterase
Name:Acetylcholinesterase
Type:n/a
Mol. Mass.:65900.74
Organism:Tetronarce californica (Pacific electric ray) (Torpedo californica)
Description:P04058
Residue:586
BDBM86010
NameBDBM86010
Synonyms:Chalcone, 10
TypeSmall organic molecule
Emp. Form.C15H11ClO2
Mol. Mass.258.7
SMILESOc1ccc(Cl)cc1C(=O)\C=C\c1ccccc1