Reaction Details
TargetAcetylcholinesterase
LigandBDBM86022
Substrate/Competitorn/a
Meas. Tech.Enzyme Inhibition Assay
Temperature303.15±0 K
Ki 3.00e+4± 1.05e+3 nM
Citation Atta-ur-Rahman, AKhalid, ASultana, NGhayur, MNMesaik, MAKhan, MRGilani, AHChoudhary, MI New natural cholinesterase inhibiting and calcium channel blocking quinoline alkaloids. J Enzyme Inhib Med Chem21:703-10 (2006) 
 
Acetylcholinesterase
Name:Acetylcholinesterase
Type:n/a
Mol. Mass.:65900.74
Organism:Tetronarce californica (Pacific electric ray) (Torpedo californica)
Description:P04058
Residue:586
BDBM86022
NameBDBM86022
Synonyms:Ribalinine, 3
TypeSmall organic molecule
Emp. Form.C15H17NO3
Mol. Mass.259.3004
SMILESCn1c2OC(C)(C)[C@H](O)Cc2c(=O)c2ccccc12