Reaction Details
TargetCarboxylic ester hydrolase
LigandBDBM86021
Substrate/Competitorn/a
Meas. Tech.Enzyme Inhibition Assay
Temperature303.15±0 K
Ki 9.00e+4± 1.5e+3 nM
Citation Atta-ur-Rahman, AKhalid, ASultana, NGhayur, MNMesaik, MAKhan, MRGilani, AHChoudhary, MI New natural cholinesterase inhibiting and calcium channel blocking quinoline alkaloids. J Enzyme Inhib Med Chem21:703-10 (2006) 
 
Carboxylic ester hydrolase
Name:Carboxylic ester hydrolase
Type:Protein
Mol. Mass.:68842.83
Organism:Equus caballus (Horse)
Description:Q9N1N9
Residue:602
BDBM86021
NameBDBM86021
Synonyms:2,2,6-Trimethyl-3,4,5,6-tetrahydro-2H-pyrano[3,2-c]quinoline-5-one, 2
TypeSmall organic molecule
Emp. Form.C15H17NO3
Mol. Mass.259.3004
SMILESCn1c2ccccc2c2OC(C)(C)[C@@H](O)Cc2c1=O