Reaction Details
TargetSerine/threonine-protein kinase TBK1
LigandBDBM276829
Substrate/Competitorn/a
Meas. Tech.Biological Assay for TBK1 and IKKs
pH7±n/a
IC50 1.34±n/a nM
Commentsextracted
Citation Du, ZGuerrero, JAKaplan, JAKnox, Jr., JENaduthambi, DPhillips, BWVenkataramani, CWang, PWatkins, WJZablocki, J Tank-binding kinase inhibitor compounds US Patent US10072001 Publication Date 9/11/2018
 
Serine/threonine-protein kinase TBK1
Name:Serine/threonine-protein kinase TBK1
Type:protein
Mol. Mass.:83645.20
Organism:Homo sapiens (Human)
Description:Q9UHD2
Residue:729
BDBM276829
NameBDBM276829
Synonyms:US10072001, Example 15 | US10259811, Example 15
TypeSmall organic molecule
Emp. Form.C30H29N5O4
Mol. Mass.523.5824
SMILESOCC(=O)N1CC[C@H](C1)Oc1ccc(cc1C#N)-c1ccnc2[nH]c(cc12)-c1ccc(cc1)N1CCOCC1