Reaction Details
TargetInhibitor of nuclear factor kappa-B kinase subunit epsilon
LigandBDBM276868
Substrate/Competitorn/a
Meas. Tech.Biological Assay for TBK1 and IKKs
pH7±n/a
IC50 0.810±n/a nM
Commentsextracted
Citation Du, ZGuerrero, JAKaplan, JAKnox, Jr., JENaduthambi, DPhillips, BWVenkataramani, CWang, PWatkins, WJZablocki, J Tank-binding kinase inhibitor compounds US Patent US10072001 Publication Date 9/11/2018
 
Inhibitor of nuclear factor kappa-B kinase subunit epsilon
Name:Inhibitor of nuclear factor kappa-B kinase subunit epsilon
Type:Serine/threonine-protein kinase
Mol. Mass.:80475.98
Organism:Homo sapiens (Human)
Description:Kinase inhibitory activity was determined using recombinant human IKK-epsilon expressed in baculovirus as a FLAG-tagged fusion protein.
Residue:716
BDBM276868
NameBDBM276868
Synonyms:US10072001, Example 54 | US10259811, Example 54
TypeSmall organic molecule
Emp. Form.C29H29N5O2
Mol. Mass.479.5729
SMILESN#Cc1cc(ccc1OC1CCOCC1)-c1ccnc2[nH]c(cc12)-c1ccc(cc1)N1CCNCC1