Reaction Details
TargetSerine/threonine-protein kinase TBK1
LigandBDBM276896
Substrate/Competitorn/a
Meas. Tech.Biological Assay for TBK1 and IKKs
pH7±n/a
IC50 0.900±n/a nM
Commentsextracted
Citation Du, ZGuerrero, JAKaplan, JAKnox, Jr., JENaduthambi, DPhillips, BWVenkataramani, CWang, PWatkins, WJZablocki, J Tank-binding kinase inhibitor compounds US Patent US10072001 Publication Date 9/11/2018
 
Serine/threonine-protein kinase TBK1
Name:Serine/threonine-protein kinase TBK1
Type:protein
Mol. Mass.:83645.20
Organism:Homo sapiens (Human)
Description:Q9UHD2
Residue:729
BDBM276896
NameBDBM276896
Synonyms:US10072001, Example 82 | US10259811, Example 82
TypeSmall organic molecule
Emp. Form.C30H31N5O2
Mol. Mass.493.5994
SMILESCN1CCN(CC1)c1ccc(cc1)-c1cc2c(ccnc2[nH]1)-c1ccc(OC2CCOCC2)c(c1)C#N