Reaction Details
TargetSerine/threonine-protein kinase TBK1
LigandBDBM277059
Substrate/Competitorn/a
Meas. Tech.Biological Assay for TBK1 and IKKs
pH7±n/a
IC50 0.883±n/a nM
Commentsextracted
Citation Du, ZGuerrero, JAKaplan, JAKnox, Jr., JENaduthambi, DPhillips, BWVenkataramani, CWang, PWatkins, WJZablocki, J Tank-binding kinase inhibitor compounds US Patent US10072001 Publication Date 9/11/2018
 
Serine/threonine-protein kinase TBK1
Name:Serine/threonine-protein kinase TBK1
Type:protein
Mol. Mass.:83645.20
Organism:Homo sapiens (Human)
Description:Q9UHD2
Residue:729
BDBM277059
NameBDBM277059
Synonyms:US10072001, Example 251 | US10259811, Example 251
TypeSmall organic molecule
Emp. Form.C30H32N8O3
Mol. Mass.552.6269
SMILESCN1CCN(CC1)c1ccc(cc1)-c1nc2c(ncnc2[nH]1)-c1ccc(OC2CCN(CC2)C(=O)CO)c(c1)C#N