Reaction Details
TargetHistamine H1 receptor
LigandBDBM86030
Substrate/Competitorn/a
Ki 122±n/a nM
CommentsPDSP_2344
Citation Booth, RGMoniri, NHBakker, RAChoksi, NYNix, WBTimmerman, HLeurs, R A novel phenylaminotetralin radioligand reveals a subpopulation of histamine H(1) receptors. J Pharmacol Exp Ther302:328-36 (2002) 
 
Histamine H1 receptor
Name:Histamine H1 receptor
Type:G Protein-Coupled Receptor (GPCR)
Mol. Mass.:55808.72
Organism:Homo sapiens (Human)
Description:Cell pellets from SK-N-MC cells transfected with human H1 receptor were used in binding assay.
Residue:487
BDBM86030
NameBDBM86030
Synonyms:cis-H2-PAT(+)
TypeSmall organic molecule
Emp. Form.C18H21N
Mol. Mass.251.366
SMILESCN(C)[C@H]1C[C@@H](c2ccccc2)c2ccccc2C1