Reaction Details
TargetHistamine H1 receptor
LigandBDBM81466
Substrate/Competitorn/a
Ki 98±n/a nM
CommentsPDSP_1061
Citation Booth, RGMoniri, NHBakker, RAChoksi, NYNix, WBTimmerman, HLeurs, R A novel phenylaminotetralin radioligand reveals a subpopulation of histamine H(1) receptors. J Pharmacol Exp Ther302:328-36 (2002) 
 
Histamine H1 receptor
Name:Histamine H1 receptor
Type:G Protein-Coupled Receptor (GPCR)
Mol. Mass.:55641.53
Organism:Cavia porcellus (domestic guinea pig)
Description:Guinea pig cerebellum was used in binding assay.
Residue:488
BDBM81466
NameBDBM81466
Synonyms:CAS_23095-76-3 l-Chlorpheniramine
TypeSmall organic molecule
Emp. Form.C10H7ClO4
Mol. Mass.226.613
SMILESOC(=O)C=CC(=O)Oc1ccc(Cl)cc1