Reaction Details
TargetHistamine H1 receptor
LigandBDBM86029
Substrate/Competitorn/a
Ki 23±n/a nM
CommentsPDSP_2341
Citation Booth, RGMoniri, NHBakker, RAChoksi, NYNix, WBTimmerman, HLeurs, R A novel phenylaminotetralin radioligand reveals a subpopulation of histamine H(1) receptors. J Pharmacol Exp Ther302:328-36 (2002) 
 
Histamine H1 receptor
Name:Histamine H1 receptor
Type:G Protein-Coupled Receptor (GPCR)
Mol. Mass.:55641.53
Organism:Cavia porcellus (domestic guinea pig)
Description:Guinea pig cerebellum was used in binding assay.
Residue:488
BDBM86029
NameBDBM86029
Synonyms:trans-H2-PAT(+)
TypeSmall organic molecule
Emp. Form.C18H21N
Mol. Mass.251.366
SMILESCN(C)[C@@H]1C[C@@H](c2ccccc2)c2ccccc2C1