Reaction Details
TargetMu-type opioid receptor
LigandBDBM50097579
Substrate/Competitorn/a
Ki 0.34±n/a nM
CommentsPDSP_2328
Citation Bidlack, JMCohen, DJMcLaughlin, JPLou, RYe, YWentland, MP 8-Carboxamidocyclazocine: a long-acting, novel benzomorphan. J Pharmacol Exp Ther302:374-80 (2002) 
 
Mu-type opioid receptor
Name:Mu-type opioid receptor
Type:Enzyme Catalytic Domain
Mol. Mass.:11165.58
Organism:GUINEA PIG
Description:P97266
Residue:98
BDBM50097579
NameBDBM50097579
Synonyms:(6S,11R)-3-Cyclopropylmethyl-6,11-dimethyl-1,2,3,4,5,6-hexahydro-2,6-methano-benzo[d]azocine-8-carboxylic acid amide 8-carboxamidocyclazocine US9656961, Example 00157
TypeSmall organic molecule
Emp. Form.C19H26N2O
Mol. Mass.298.4225
SMILESC[C@H]1C2Cc3ccc(cc3[C@@]1(C)CCN2CC1CC1)C(N)=O