Reaction Details
TargetAlpha-2A adrenergic receptor
LigandBDBM86036
Substrate/Competitorn/a
Ki 716.5±n/a nM
CommentsPDSP_3177
Citation Butterweck, VNahrstedt, AEvans, JHufeisen, SRauser, LSavage, JPopadak, BErnsberger, PRoth, BL In vitro receptor screening of pure constituents of St. John's wort reveals novel interactions with a number of GPCRs. Psychopharmacology (Berl)162:193-202 (2002) 
 
Alpha-2A adrenergic receptor
Name:Alpha-2A adrenergic receptor
Type:Enzyme
Mol. Mass.:48979.91
Organism:Homo sapiens (Human)
Description:P08913
Residue:450
BDBM86036
NameBDBM86036
Synonyms:CAS_5318390 Hyperoside NSC_5318390 | NSC_97331
TypeSmall organic molecule
Emp. Form.C21H20O12
Mol. Mass.464.3763
SMILESOCC1OC(Oc2c(O)c3c(cc(O)cc3=O)oc2-c2ccc(O)c(O)c2)C(O)C(O)C1O