Reaction Details
TargetBeta-2 adrenergic receptor
LigandBDBM50333880
Substrate/Competitorn/a
Ki>10000±n/a nM
CommentsPDSP_3174
Citation Butterweck, VNahrstedt, AEvans, JHufeisen, SRauser, LSavage, JPopadak, BErnsberger, PRoth, BL In vitro receptor screening of pure constituents of St. John's wort reveals novel interactions with a number of GPCRs. Psychopharmacology (Berl)162:193-202 (2002) 
 
Beta-2 adrenergic receptor
Name:Beta-2 adrenergic receptor
Type:PROTEIN
Mol. Mass.:46896.26
Organism:Rattus norvegicus
Description:ChEMBL_38603
Residue:418
BDBM50333880
NameBDBM50333880
Synonyms:CHEMBL1614664 Pseudohypericin
TypeSmall organic molecule
Emp. Form.C30H16O9
Mol. Mass.520.4426
SMILESCc1cc(O)c2c3c1c1c(CO)cc(O)c4c1c1c5c(c(O)cc(O)c5c4=O)c4c(O)cc(O)c(c4c31)c2=O