Reaction Details
TargetD(1A) dopamine receptor
LigandBDBM50242259
Substrate/Competitorn/a
Ki 595.8±n/a nM
CommentsPDSP_3172
Citation Butterweck, VNahrstedt, AEvans, JHufeisen, SRauser, LSavage, JPopadak, BErnsberger, PRoth, BL In vitro receptor screening of pure constituents of St. John's wort reveals novel interactions with a number of GPCRs. Psychopharmacology (Berl)162:193-202 (2002) 
 
D(1A) dopamine receptor
Name:D(1A) dopamine receptor
Type:Enzyme
Mol. Mass.:49303.43
Organism:Homo sapiens (Human)
Description:P21728
Residue:446
BDBM50242259
NameBDBM50242259
Synonyms:CHEMBL516641 | HYPERFORIN
TypeSmall organic molecule
Emp. Form.C35H52O4
Mol. Mass.536.785
SMILES[#6]-[#6](-[#6])-[#6](=O)[C@]12[#6](=O)-[#6](-[#6]\[#6]=[#6](/[#6])-[#6])-[#6](=O)[C@@]([#6]\[#6]=[#6](\[#6])-[#6])([#6]-[#6@H](-[#6]\[#6]=[#6](/[#6])-[#6])[C@@]1([#6])[#6]-[#6]\[#6]=[#6](/[#6])-[#6])[#6]2=O