Reaction Details
TargetSodium-dependent dopamine transporter
LigandBDBM50129952
Substrate/Competitorn/a
Ki 877.4±n/a nM
CommentsPDSP_3171
Citation Butterweck, VNahrstedt, AEvans, JHufeisen, SRauser, LSavage, JPopadak, BErnsberger, PRoth, BL In vitro receptor screening of pure constituents of St. John's wort reveals novel interactions with a number of GPCRs. Psychopharmacology (Berl)162:193-202 (2002) 
 
Sodium-dependent dopamine transporter
Name:Sodium-dependent dopamine transporter
Type:Enzyme Catalytic Domain
Mol. Mass.:75707.43
Organism:BOVINE
Description:Dopamine Transporter SLC6A3 BOVINE::P27922
Residue:693
BDBM50129952
NameBDBM50129952
Synonyms:2-(3-(5,7-dihydroxy-2-(4-hydroxyphenyl)-4-oxo-4H-chromen-8-yl)-4-hydroxyphenyl)-5,7-dihydroxy-4H-chromen-4-one Amentoflavone cid_5281600
TypeSmall organic molecule
Emp. Form.C30H18O10
Mol. Mass.538.4579
SMILESOc1ccc(cc1)-c1cc(=O)c2c(O)cc(O)c(-c3cc(ccc3O)-c3cc(O)c4c(cc(O)cc4=O)o3)c2o1