Reaction Details
TargetGlutamate receptor ionotropic, NMDA 1
LigandBDBM7460
Substrate/Competitorn/a
Ki>10000±n/a nM
CommentsPDSP_3175
Citation Butterweck, VNahrstedt, AEvans, JHufeisen, SRauser, LSavage, JPopadak, BErnsberger, PRoth, BL In vitro receptor screening of pure constituents of St. John's wort reveals novel interactions with a number of GPCRs. Psychopharmacology (Berl)162:193-202 (2002) 
 
Glutamate receptor ionotropic, NMDA 1
Name:Glutamate receptor ionotropic, NMDA 1
Type:Enzyme Catalytic Domain
Mol. Mass.:105533.40
Organism:RAT
Description:P35439
Residue:938
BDBM7460
NameBDBM7460
Synonyms:2-(3,4-dihydroxyphenyl)-3,5,7-trihydroxy-4H-chromen-4-one 2-(3,4-dihydroxyphenyl)-3,5,7-trihydroxy-chromone;hydrate Quercetin Quercetin (21) US11021454, Compound Quercetin med.21724, Compound 4
TypeSmall organic molecule
Emp. Form.C15H10O7
Mol. Mass.302.2357
SMILESOc1cc(O)c2c(c1)oc(-c1ccc(O)c(O)c1)c(O)c2=O