Reaction Details
TargetNicotinic acetylcholine receptor
LigandBDBM50048392
Substrate/Competitorn/a
Ki>10000±n/a nM
CommentsPDSP_444
Citation Miller, DKWong, EHChesnut, MDDwoskin, LP Reboxetine: functional inhibition of monoamine transporters and nicotinic acetylcholine receptors. J Pharmacol Exp Ther302:687-95 (2002) 
 
Nicotinic acetylcholine receptor
Name:Nicotinic acetylcholine receptor
Type:Enzyme Catalytic Domain
Mol. Mass.:2478.99
Organism:RAT
Description:n-AChR 0 RAT::Q62594
Residue:23
BDBM50048392
NameBDBM50048392
Synonyms:2-(tert-butylamino)-1-(3-chlorophenyl)propan-1-one BUPROPION HYDROCHLORIDE US9944618, Compound ID No. 176
TypeSmall organic molecule
Emp. Form.C13H18ClNO
Mol. Mass.239.741
SMILESCC(NC(C)(C)C)C(=O)c1cccc(Cl)c1